{"text_format":"1","workbook":"xlsx","n_sheets":5,"sheets":["Sensitivity Analysis Tool","potential parameter values","change_CR_results","eliminate_OLA_results","repeal_ATR_results"],"not_rendered":{"charts":0,"images":11,"macros":1,"external_links":0,"defined_names":1,"comments":0,"pivot_tables":0},"unopened":[],"bounds":{"document_bytes":16777216,"sheet_cells":100000,"rows_first":2000,"rows_last":500,"rows_between":2000,"halvings":0,"cell_chars":16384,"cell_head_chars":4096},"cells_cut":0,"cells_raw":0,"read":"whole","date_system":"1900"}

{"sheet":"Sensitivity Analysis Tool","index":0,"n_rows":57,"n_cols":7,"rows_kept":57,"cut":false,"hidden":false,"merged":[[4,0,4,3],[30,0,31,0],[14,0,15,0],[7,0,8,0],[22,0,23,0],[28,0,29,0],[7,3,8,6],[26,3,28,6],[13,3,15,6]]}
["This workbook supplements the Congressional Budget Office's September 2019 report Financial Regulation and the Federal Budget."]
["www.cbo.gov/publication/55586"]
[]
[]
["In its report Financial Regulation and the Federal Budget, CBO analyzes three illustrative polices and finds that the largest budgetary effects of implementing them would stem from macroeconomic feedback. The projections underlying that analysis are highly uncertain because they rely on estimates of probabilities of rare events and on parameters representing how policies might affect outcomes such as bank failures and financial crises. \n\nTo illustrate the sensitivity of the agency’s projections to selected parameters, CBO has developed this interactive tool, which allows users to choose alternative values for key parameters and see how the resulting projections differ from those in the report."]
["Parameter","Value",null,null,"Lower Capital Requirements by 1 Percentage Point","Eliminate Orderly Liquidation Authority","Repeal the\nAbility-to-Repay\nMortgage Rule"]
["General"]
["Likelihood of a Financial Crisis in Any Given Year",null,null,"Direct Budgetary Effects of the Three Illustrative Policies, 2020 to 2029\n(Billions of dollars)"]
[]
["Capital Requirements",null,null,"Effects on Revenues",{"$f":"INDEX(change_CR_results!G:G,'Sensitivity Analysis Tool'!C44)","v":0.17499999999999999},{"$f":"INDEX(eliminate_OLA_results!E:E,'Sensitivity Analysis Tool'!C45)","v":5.819},0]
["Policy: Change in Capital Requirements",null,null,"Effects on Noninterest Outlays",{"$f":"INDEX(change_CR_results!H:H,'Sensitivity Analysis Tool'!C44)","v":-5.8000000000000003E-2},{"$f":"INDEX(eliminate_OLA_results!F:F,'Sensitivity Analysis Tool'!C45)","v":19.504999999999999},{"$f":"INDEX(repeal_ATR_results!F:F,'Sensitivity Analysis Tool'!C46)","v":0.48499999999999999}]
[null,null,null,"Increase or Decrease (-) in the Deficit",{"$f":"INDEX(change_CR_results!I:I,'Sensitivity Analysis Tool'!C44)","v":-0.23300000000000001},{"$f":"INDEX(eliminate_OLA_results!G:G,'Sensitivity Analysis Tool'!C45)","v":13.686},{"$f":"INDEX(repeal_ATR_results!G:G,'Sensitivity Analysis Tool'!C46)","v":0.42599999999999999}]
[]
[null,null,null,"Macroeconomic Feedback Under Baseline Economic Conditions, 2020 to 2029\n(Billions of dollars)"]
["Change in Bank Failure Rate for Each Percentage-Point Change in Capital"]
[]
["Change in Deposit Insurance Premium Rate for Each Percentage-Point Change in Capital",null,null,"Effects on Revenues"]
[null,null,null,"From change in financing mix",{"$f":"INDEX(change_CR_results!K:K,'Sensitivity Analysis Tool'!C44)","v":-17.780999999999999},0,0]
["  Effect on Tax Liability of a 1 Percentage-Point Increase in Debt",null,null,"From increase in gross domestic product",{"$f":"INDEX(change_CR_results!J:J,'Sensitivity Analysis Tool'!C44)","v":3.7029999999999998},0,{"$f":"INDEX(repeal_ATR_results!H:H,'Sensitivity Analysis Tool'!C46)","v":0.71699999999999997}]
[null,null,null,"Total",{"$f":"INDEX(change_CR_results!L:L,'Sensitivity Analysis Tool'!C44)","v":-14.077999999999999},0,{"$f":"G19","v":0.71699999999999997}]
["Orderly Liquidation Authority",null,null,"Effects on Outlays"]
[null,null,null,"Noninterest outlays",{"$f":"INDEX(change_CR_results!M:M,'Sensitivity Analysis Tool'!C44)","v":0.52400000000000002},0,{"$f":"INDEX(repeal_ATR_results!I:I,'Sensitivity Analysis Tool'!C46)","v":0}]
["Effect of Orderly Liquidation Authority on Likelihood of a Financial Crisis",null,null,"Interest outlays",{"$f":"INDEX(change_CR_results!N:N,'Sensitivity Analysis Tool'!C44)","v":-0.872},0,{"$f":"INDEX(repeal_ATR_results!J:J,'Sensitivity Analysis Tool'!C46)","v":0}]
[null,null,null,"Total",{"$f":"INDEX(change_CR_results!O:O,'Sensitivity Analysis Tool'!C44)","v":-0.34799999999999998},0,{"$f":"INDEX(repeal_ATR_results!K:K,'Sensitivity Analysis Tool'!C46)","v":0}]
["Percentage of Financial Crises That Would Be More Severe If Orderly Liquidation Authority Was Eliminated",null,null,"Increase or Decrease (-) in the Deficit",{"$f":"INDEX(change_CR_results!P:P,'Sensitivity Analysis Tool'!C44)","v":13.728999999999999},0,{"$f":"INDEX(repeal_ATR_results!L:L,'Sensitivity Analysis Tool'!C46)","v":-0.71699999999999997}]
[]
["Ability-to-Repay Rule",null,null,"Macroeconomic Feedback Stemming From the Illustrative Policies’ Effects  \non the Likelihood and Severity of Financial Crises, 2020 to 2029\n(Billions of dollars)"]
[]
["Change in Bank Failure Rate If the Ability-to-Repay Rule Was Eliminated"]
[null,null,null,"Effects on Revenues",{"$f":"INDEX(change_CR_results!Q:Q,'Sensitivity Analysis Tool'!C44)","v":-66.364000000000004},{"$f":"INDEX(eliminate_OLA_results!O:O,'Sensitivity Analysis Tool'!C45)","v":-141.86099999999999},{"$f":"INDEX(repeal_ATR_results!M:M,'Sensitivity Analysis Tool'!C46)","v":-3.3180000000000001}]
{"$rows_left_out":28}
{"sheet":"potential parameter values","index":1,"n_rows":25,"n_cols":6,"rows_kept":25,"cut":false,"hidden":true,"merged":[[20,4,21,5],[0,2,0,3],[6,2,6,3],[6,4,6,5],[11,2,11,3],[11,4,11,5],[16,4,16,5],[16,2,16,3]]}
[null,null,null,null,"Annual Probability of a Financial Crisis that Disrupts Economy"]
[null,null,null,null,"1 percent",0.01]
[null,null,null,null,"1.5 percent (central estimate)",1.4999999999999999E-2]
[null,null,null,null,"2 percent",0.02]
[]
[]
[null,null,"Change in Capital Requirements",null,"Change in Bank Failure Rate for Each Percentage-Point Change in Capital"]
[null,null,"2 percent lower",-0.02,"5 percent",0.05]
[null,null,"1 percent lower (central estimate)",-0.01,"20 percent (central estimate)",0.2]
[null,null,"1 percent higher",0.01,"60 percent",0.6]
[]
[null,null,"Change in Deposit Insurance Premium Rate for Each Percentage-Point Change in Capital",null,"Effect on Tax Liability of a 1 Percentage Point Increase in Debt"]
[null,null,"0 basis points",0,0,0]
[null,null,"0.3 basis points (central estimate)",0.3,"-0.8 basis points (central estimate)",-0.8]
[null,null,"1 basis point",1,"-1.5 basis points",-1.5]
[]
[null,null,"Percentage of Financial Crises that Would be More Severe if Orderly Liquidation Authority Was Eliminated",null,"Effect of Orderly Liquidation Authority on the Likelihood of a Crisis"]
[null,null,"0 percent",0,"10 percent",0.1]
[null,null,"33.3 percent (central estimate)",0.33300000000000002,"0 percent (central estimate)",0]
[null,null,"50 percent",0.5,"-10 percent",-0.1]
[null,null,null,null,"Effective Tax Rate on Services From Owner-Occupied Housing"]
[null,null,"Change in Bank Failure Rate if the Ability-to-Repay Rule was Repealed"]
[null,null,"None",0,"-5 percent",-0.05]
[null,null,"1 percent (central estimate)",0.01,"4 percent (central estimate)",0.04]
[null,null,"2 percent",0.02,"10 percent",0.1]

{"sheet":"change_CR_results","index":2,"n_rows":244,"n_cols":21,"rows_kept":244,"cut":false,"hidden":true,"merged":[]}
[null,"prob_crisis","CR_change","CR_failure","premium_change","tax_change","direct_revenues_total","direct_outlays_total","direct_primary_deficit","noncrisis_revenues_gdp_growth","noncrisis_revenues_financing_mix","noncrisis_revenues_total","noncrisis_outlays_noninterest","noncrisis_outlays_interest","noncrisis_outlays_total","noncrisis_primary_deficit","crisis_revenues_total","crisis_outlays_noninterest","crisis_outlays_interest","crisis_outlays_total","crisis_primary_deficit"]
[0,0.01,-0.02,0.05,0,0,8.6999999999999994E-2,3.1869999999999998,3.1,3.6869999999999998,0,3.6869999999999998,0.52100000000000002,-0.86799999999999999,-0.34699999999999998,-4.0330000000000004,-22.998999999999999,0.48299999999999998,-10.807,-10.324,12.675000000000001]
[1,0.01,-0.02,0.05,0,-0.8,8.6999999999999994E-2,3.1869999999999998,3.1,5.1260000000000003,-35.561999999999998,-30.437000000000001,0.72499999999999998,-1.2070000000000001,-0.48199999999999998,29.954000000000001,-22.998999999999999,0.48299999999999998,-10.807,-10.324,12.675000000000001]
[2,0.01,-0.02,0.05,0,-1.5,8.6999999999999994E-2,3.1869999999999998,3.1,6.3849999999999998,-66.680000000000007,-60.295000000000002,0.90300000000000002,-1.504,-0.60099999999999998,59.694000000000003,-22.998999999999999,0.48299999999999998,-10.807,-10.324,12.675000000000001]
[3,0.01,-0.02,0.05,0.3,0,8.6999999999999994E-2,-9.6780000000000008,-9.7650000000000006,3.1469999999999998,0,3.1469999999999998,0.44500000000000001,-0.74099999999999999,-0.29599999999999999,-3.4430000000000001,-22.998999999999999,0.48299999999999998,-10.807,-10.324,12.675000000000001]
[4,0.01,-0.02,0.05,0.3,-0.8,8.6999999999999994E-2,-9.6780000000000008,-9.7650000000000006,4.5860000000000003,-35.561999999999998,-30.975999999999999,0.64900000000000002,-1.08,-0.43099999999999999,30.545000000000002,-22.998999999999999,0.48299999999999998,-10.807,-10.324,12.675000000000001]
[5,0.01,-0.02,0.05,0.3,-1.5,8.6999999999999994E-2,-9.6780000000000008,-9.7650000000000006,5.8449999999999998,-66.680000000000007,-60.834000000000003,0.82699999999999996,-1.377,-0.55000000000000004,60.283999999999999,-22.998999999999999,0.48299999999999998,-10.807,-10.324,12.675000000000001]
[6,0.01,-0.02,0.05,1,0,8.6999999999999994E-2,-39.695,-39.781999999999996,1.8879999999999999,0,1.8879999999999999,0.26700000000000002,-0.44500000000000001,-0.17799999999999999,-2.0649999999999999,-22.998999999999999,0.48299999999999998,-10.807,-10.324,12.675000000000001]
[7,0.01,-0.02,0.05,1,-0.8,8.6999999999999994E-2,-39.695,-39.781999999999996,3.327,-35.561999999999998,-32.235999999999997,0.47099999999999997,-0.78400000000000003,-0.313,31.922999999999998,-22.998999999999999,0.48299999999999998,-10.807,-10.324,12.675000000000001]
[8,0.01,-0.02,0.05,1,-1.5,8.6999999999999994E-2,-39.695,-39.781999999999996,4.5860000000000003,-66.680000000000007,-62.093000000000004,0.64900000000000002,-1.08,-0.43099999999999999,61.661999999999999,-22.998999999999999,0.48299999999999998,-10.807,-10.324,12.675000000000001]
[9,0.01,-0.02,0.2,0,0,0.34899999999999998,12.749000000000001,12.4,7.3940000000000001,0,7.3940000000000001,1.046,-1.7410000000000001,-0.69599999999999995,-8.0890000000000004,-98.728999999999999,2.0739999999999998,-46.393000000000001,-44.319000000000003,54.41]
[10,0.01,-0.02,0.2,0,-0.8,0.34899999999999998,12.749000000000001,12.4,8.8330000000000002,-35.561999999999998,-26.73,1.2490000000000001,-2.08,-0.83099999999999996,25.899000000000001,-98.728999999999999,2.0739999999999998,-46.393000000000001,-44.319000000000003,54.41]
[11,0.01,-0.02,0.2,0,-1.5,0.34899999999999998,12.749000000000001,12.4,10.092000000000001,-66.680000000000007,-56.587000000000003,1.4279999999999999,-2.3769999999999998,-0.94899999999999995,55.637999999999998,-98.728999999999999,2.0739999999999998,-46.393000000000001,-44.319000000000003,54.41]
[12,0.01,-0.02,0.2,0.3,0,0.34899999999999998,-0.11600000000000001,-0.46500000000000002,6.8540000000000001,0,6.8540000000000001,0.96899999999999997,-1.6140000000000001,-0.64500000000000002,-7.4989999999999997,-98.728999999999999,2.0739999999999998,-46.393000000000001,-44.319000000000003,54.41]
[13,0.01,-0.02,0.2,0.3,-0.8,0.34899999999999998,-0.11600000000000001,-0.46500000000000002,8.2929999999999993,-35.561999999999998,-27.268999999999998,1.173,-1.9530000000000001,-0.78,26.489000000000001,-98.728999999999999,2.0739999999999998,-46.393000000000001,-44.319000000000003,54.41]
[14,0.01,-0.02,0.2,0.3,-1.5,0.34899999999999998,-0.11600000000000001,-0.46500000000000002,9.5519999999999996,-66.680000000000007,-57.127000000000002,1.351,-2.25,-0.89900000000000002,56.228000000000002,-98.728999999999999,2.0739999999999998,-46.393000000000001,-44.319000000000003,54.41]
[15,0.01,-0.02,0.2,1,0,0.34899999999999998,-30.134,-30.483000000000001,5.5949999999999998,0,5.5949999999999998,0.79100000000000004,-1.3180000000000001,-0.52600000000000002,-6.1210000000000004,-98.728999999999999,2.0739999999999998,-46.393000000000001,-44.319000000000003,54.41]
[16,0.01,-0.02,0.2,1,-0.8,0.34899999999999998,-30.134,-30.483000000000001,7.0339999999999998,-35.561999999999998,-28.527999999999999,0.995,-1.657,-0.66200000000000003,27.867000000000001,-98.728999999999999,2.0739999999999998,-46.393000000000001,-44.319000000000003,54.41]
[17,0.01,-0.02,0.2,1,-1.5,0.34899999999999998,-30.134,-30.483000000000001,8.2929999999999993,-66.680000000000007,-58.386000000000003,1.173,-1.9530000000000001,-0.78,57.606000000000002,-98.728999999999999,2.0739999999999998,-46.393000000000001,-44.319000000000003,54.41]
[18,0.01,-0.02,0.6,0,0,1.0469999999999999,38.246000000000002,37.198999999999998,18.757999999999999,0,18.757999999999999,2.653,-4.4180000000000001,-1.7649999999999999,-20.523,-350.03800000000001,7.3529999999999998,-164.483,-157.12899999999999,192.90799999999999]
[19,0.01,-0.02,0.6,0,-0.8,1.0469999999999999,38.246000000000002,37.198999999999998,20.196999999999999,-35.561999999999998,-15.365,2.8570000000000002,-4.7569999999999997,-1.9,13.465,-350.03800000000001,7.3529999999999998,-164.483,-157.12899999999999,192.90799999999999]
[20,0.01,-0.02,0.6,0,-1.5,1.0469999999999999,38.246000000000002,37.198999999999998,21.456,-66.680000000000007,-45.222999999999999,3.0350000000000001,-5.0540000000000003,-2.0190000000000001,43.204000000000001,-350.03800000000001,7.3529999999999998,-164.483,-157.12899999999999,192.90799999999999]
[21,0.01,-0.02,0.6,0.3,0,1.0469999999999999,25.381,24.334,18.218,0,18.218,2.577,-4.2910000000000004,-1.714,-19.931999999999999,-350.03800000000001,7.3529999999999998,-164.483,-157.12899999999999,192.90799999999999]
[22,0.01,-0.02,0.6,0.3,-0.8,1.0469999999999999,25.381,24.334,19.658000000000001,-35.561999999999998,-15.904999999999999,2.7810000000000001,-4.63,-1.849,14.055,-350.03800000000001,7.3529999999999998,-164.483,-157.12899999999999,192.90799999999999]
[23,0.01,-0.02,0.6,0.3,-1.5,1.0469999999999999,25.381,24.334,20.917000000000002,-66.680000000000007,-45.762999999999998,2.9590000000000001,-4.9260000000000002,-1.968,43.795000000000002,-350.03800000000001,7.3529999999999998,-164.483,-157.12899999999999,192.90799999999999]
[24,0.01,-0.02,0.6,1,0,1.0469999999999999,-4.6360000000000001,-5.6840000000000002,16.959,0,16.959,2.399,-3.9940000000000002,-1.595,-18.555,-350.03800000000001,7.3529999999999998,-164.483,-157.12899999999999,192.90799999999999]
[25,0.01,-0.02,0.6,1,-0.8,1.0469999999999999,-4.6360000000000001,-5.6840000000000002,18.398,-35.561999999999998,-17.164000000000001,2.6019999999999999,-4.3330000000000002,-1.7310000000000001,15.433,-350.03800000000001,7.3529999999999998,-164.483,-157.12899999999999,192.90799999999999]
[26,0.01,-0.02,0.6,1,-1.5,1.0469999999999999,-4.6360000000000001,-5.6840000000000002,19.658000000000001,-66.680000000000007,-47.021999999999998,2.7810000000000001,-4.63,-1.849,45.173000000000002,-350.03800000000001,7.3529999999999998,-164.483,-157.12899999999999,192.90799999999999]
[27,0.01,-0.01,0.05,0,0,4.3999999999999997E-2,1.5940000000000001,1.55,1.6659999999999999,0,1.6659999999999999,0.23599999999999999,-0.39200000000000002,-0.157,-1.823,-11.218999999999999,0.23599999999999999,-5.2720000000000002,-5.0359999999999996,6.1829999999999998]
[28,0.01,-0.01,0.05,0,-0.8,4.3999999999999997E-2,1.5940000000000001,1.55,2.3860000000000001,-17.780999999999999,-15.396000000000001,0.33700000000000002,-0.56200000000000006,-0.224,15.170999999999999,-11.218999999999999,0.23599999999999999,-5.2720000000000002,-5.0359999999999996,6.1829999999999998]
{"$rows_left_out":215}
{"sheet":"eliminate_OLA_results","index":3,"n_rows":28,"n_cols":19,"rows_kept":28,"cut":false,"hidden":true,"merged":[]}
[null,"prob_crisis","OLA_fraction","OLA_effect","direct_revenues_total","direct_outlays_total","direct_primary_deficit","noncrisis_revenues_gdp_growth","noncrisis_revenues_financing_mix","noncrisis_revenues_total","noncrisis_outlays_noninterest","noncrisis_outlays_interest","noncrisis_outlays_total","noncrisis_primary_deficit","crisis_revenues_total","crisis_outlays_noninterest","crisis_outlays_interest","crisis_outlays_total","crisis_primary_deficit"]
[0,0.01,0,0.1,5.819,19.504999999999999,13.686,0,0,0,0,0,0,0,22.437999999999999,-0.47099999999999997,10.544,10.071999999999999,-12.366]
[1,0.01,0,0,5.819,19.504999999999999,13.686,0,0,0,0,0,0,0,0,0,0,0,0]
[2,0.01,0,-0.1,5.819,19.504999999999999,13.686,0,0,0,0,0,0,0,-22.437999999999999,0.47099999999999997,-10.544,-10.071999999999999,12.366]
[3,0.01,0.33300000000000002,0.1,5.819,19.504999999999999,13.686,0,0,0,0,0,0,0,-63.716999999999999,3.9449999999999998,-2.407,1.538,65.254999999999995]
[4,0.01,0.33300000000000002,0,5.819,19.504999999999999,13.686,0,0,0,0,0,0,0,-95.727999999999994,4.907,-14.39,-9.4830000000000005,86.245000000000005]
[5,0.01,0.33300000000000002,-0.1,5.819,19.504999999999999,13.686,0,0,0,0,0,0,0,-127.739,5.87,-26.373000000000001,-20.503,107.236]
[6,0.01,0.5,0.1,5.819,19.504999999999999,13.686,0,0,0,0,0,0,0,-106.794,6.1539999999999999,-8.8829999999999991,-2.7290000000000001,104.065]
[7,0.01,0.5,0,5.819,19.504999999999999,13.686,0,0,0,0,0,0,0,-143.59200000000001,7.3609999999999998,-21.585000000000001,-14.224,129.36799999999999]
[8,0.01,0.5,-0.1,5.819,19.504999999999999,13.686,0,0,0,0,0,0,0,-180.38900000000001,8.5690000000000008,-34.287999999999997,-25.719000000000001,154.66999999999999]
[9,1.4999999999999999E-2,0,0.1,5.819,19.504999999999999,13.686,0,0,0,0,0,0,0,33.182000000000002,-0.67800000000000005,15.632999999999999,14.955,-18.227]
[10,1.4999999999999999E-2,0,0,5.819,19.504999999999999,13.686,0,0,0,0,0,0,0,0,0,0,0,0]
[11,1.4999999999999999E-2,0,-0.1,5.819,19.504999999999999,13.686,0,0,0,0,0,0,0,-33.182000000000002,0.67800000000000005,-15.632999999999999,-14.955,18.227]
[12,1.4999999999999999E-2,0.33300000000000002,0.1,5.819,19.504999999999999,13.686,0,0,0,0,0,0,0,-94.492999999999995,5.827,-3.6259999999999999,2.202,96.694999999999993]
[13,1.4999999999999999E-2,0.33300000000000002,0,5.819,19.504999999999999,13.686,0,0,0,0,0,0,0,-141.86099999999999,7.2290000000000001,-21.399000000000001,-14.17,127.691]
[14,1.4999999999999999E-2,0.33300000000000002,-0.1,5.819,19.504999999999999,13.686,0,0,0,0,0,0,0,-189.22900000000001,8.6300000000000008,-39.171999999999997,-30.542000000000002,158.68700000000001]
[15,1.4999999999999999E-2,0.5,0.1,5.819,19.504999999999999,13.686,0,0,0,0,0,0,0,-158.33099999999999,9.08,-13.255000000000001,-4.1749999999999998,154.15600000000001]
[16,1.4999999999999999E-2,0.5,0,5.819,19.504999999999999,13.686,0,0,0,0,0,0,0,-212.792,10.843,-32.097999999999999,-21.254999999999999,191.53700000000001]
[17,1.4999999999999999E-2,0.5,-0.1,5.819,19.504999999999999,13.686,0,0,0,0,0,0,0,-267.25299999999999,12.605,-50.941000000000003,-38.335999999999999,228.917]
[18,0.02,0,0.1,5.819,19.504999999999999,13.686,0,0,0,0,0,0,0,43.619,-0.86699999999999999,20.605,19.738,-23.881]
[19,0.02,0,0,5.819,19.504999999999999,13.686,0,0,0,0,0,0,0,0,0,0,0,0]
[20,0.02,0,-0.1,5.819,19.504999999999999,13.686,0,0,0,0,0,0,0,-43.619,0.86699999999999999,-20.605,-19.738,23.881]
[21,0.02,0.33300000000000002,0.1,5.819,19.504999999999999,13.686,0,0,0,0,0,0,0,-124.571,7.6509999999999998,-4.8529999999999998,2.798,127.369]
[22,0.02,0.33300000000000002,0,5.819,19.504999999999999,13.686,0,0,0,0,0,0,0,-186.87799999999999,9.4640000000000004,-28.286000000000001,-18.821999999999999,168.05600000000001]
[23,0.02,0.33300000000000002,-0.1,5.819,19.504999999999999,13.686,0,0,0,0,0,0,0,-249.185,11.278,-51.72,-40.442,208.74299999999999]
[24,0.02,0.5,0.1,5.819,19.504999999999999,13.686,0,0,0,0,0,0,0,-208.666,11.91,-17.581,-5.6710000000000003,202.995]
[25,0.02,0.5,0,5.819,19.504999999999999,13.686,0,0,0,0,0,0,0,-280.31700000000001,14.196,-42.429000000000002,-28.233000000000001,252.084]
[26,0.02,0.5,-0.1,5.819,19.504999999999999,13.686,0,0,0,0,0,0,0,-351.96800000000002,16.483000000000001,-67.277000000000001,-50.793999999999997,301.17399999999998]

{"sheet":"repeal_ATR_results","index":4,"n_rows":28,"n_cols":17,"rows_kept":28,"cut":false,"hidden":true,"merged":[]}
[null,"prob_crisis","ATR_effect","housing_tax","direct_revenues_total","direct_outlays_total","direct_primary_deficit","noncrisis_revenues_total","noncrisis_outlays_noninterest","noncrisis_outlays_interest","noncrisis_outlays_total","noncrisis_primary_deficit","crisis_revenues_total","crisis_outlays_noninterest","crisis_outlays_interest","crisis_outlays_total","crisis_primary_deficit"]
[0,0.01,0,-0.05,0,0,0,-0.89600000000000002,0,0,0,0.89600000000000002,0,0,0,0,0]
[1,0.01,0,0.04,0,0,0,0.71699999999999997,0,0,0,-0.71699999999999997,0,0,0,0,0]
[2,0.01,0,0.1,0,0,0,1.7929999999999999,0,0,0,-1.7929999999999999,0,0,0,0,0]
[3,0.01,0.01,-0.05,5.8000000000000003E-2,0.48499999999999999,0.42599999999999999,-0.89600000000000002,0,0,0,0.89600000000000002,-2.2440000000000002,4.7E-2,-1.054,-1.0069999999999999,1.2370000000000001]
[4,0.01,0.01,0.04,5.8000000000000003E-2,0.48499999999999999,0.42599999999999999,0.71699999999999997,0,0,0,-0.71699999999999997,-2.2440000000000002,4.7E-2,-1.054,-1.0069999999999999,1.2370000000000001]
[5,0.01,0.01,0.1,5.8000000000000003E-2,0.48499999999999999,0.42599999999999999,1.7929999999999999,0,0,0,-1.7929999999999999,-2.2440000000000002,4.7E-2,-1.054,-1.0069999999999999,1.2370000000000001]
[6,0.01,0.02,-0.05,0.11600000000000001,0.96899999999999997,0.85299999999999998,-0.89600000000000002,0,0,0,0.89600000000000002,-4.4880000000000004,9.4E-2,-2.109,-2.0139999999999998,2.4729999999999999]
[7,0.01,0.02,0.04,0.11600000000000001,0.96899999999999997,0.85299999999999998,0.71699999999999997,0,0,0,-0.71699999999999997,-4.4880000000000004,9.4E-2,-2.109,-2.0139999999999998,2.4729999999999999]
[8,0.01,0.02,0.1,0.11600000000000001,0.96899999999999997,0.85299999999999998,1.7929999999999999,0,0,0,-1.7929999999999999,-4.4880000000000004,9.4E-2,-2.109,-2.0139999999999998,2.4729999999999999]
[9,1.4999999999999999E-2,0,-0.05,0,0,0,-0.89600000000000002,0,0,0,0.89600000000000002,0,0,0,0,0]
[10,1.4999999999999999E-2,0,0.04,0,0,0,0.71699999999999997,0,0,0,-0.71699999999999997,0,0,0,0,0]
[11,1.4999999999999999E-2,0,0.1,0,0,0,1.7929999999999999,0,0,0,-1.7929999999999999,0,0,0,0,0]
[12,1.4999999999999999E-2,0.01,-0.05,5.8000000000000003E-2,0.48499999999999999,0.42599999999999999,-0.89600000000000002,0,0,0,0.89600000000000002,-3.3180000000000001,6.8000000000000005E-2,-1.5629999999999999,-1.496,1.823]
[13,1.4999999999999999E-2,0.01,0.04,5.8000000000000003E-2,0.48499999999999999,0.42599999999999999,0.71699999999999997,0,0,0,-0.71699999999999997,-3.3180000000000001,6.8000000000000005E-2,-1.5629999999999999,-1.496,1.823]
[14,1.4999999999999999E-2,0.01,0.1,5.8000000000000003E-2,0.48499999999999999,0.42599999999999999,1.7929999999999999,0,0,0,-1.7929999999999999,-3.3180000000000001,6.8000000000000005E-2,-1.5629999999999999,-1.496,1.823]
[15,1.4999999999999999E-2,0.02,-0.05,0.11600000000000001,0.96899999999999997,0.85299999999999998,-0.89600000000000002,0,0,0,0.89600000000000002,-6.6360000000000001,0.13600000000000001,-3.1269999999999998,-2.9910000000000001,3.645]
[16,1.4999999999999999E-2,0.02,0.04,0.11600000000000001,0.96899999999999997,0.85299999999999998,0.71699999999999997,0,0,0,-0.71699999999999997,-6.6360000000000001,0.13600000000000001,-3.1269999999999998,-2.9910000000000001,3.645]
[17,1.4999999999999999E-2,0.02,0.1,0.11600000000000001,0.96899999999999997,0.85299999999999998,1.7929999999999999,0,0,0,-1.7929999999999999,-6.6360000000000001,0.13600000000000001,-3.1269999999999998,-2.9910000000000001,3.645]
[18,0.02,0,-0.05,0,0,0,-0.89600000000000002,0,0,0,0.89600000000000002,0,0,0,0,0]
[19,0.02,0,0.04,0,0,0,0.71699999999999997,0,0,0,-0.71699999999999997,0,0,0,0,0]
[20,0.02,0,0.1,0,0,0,1.7929999999999999,0,0,0,-1.7929999999999999,0,0,0,0,0]
[21,0.02,0.01,-0.05,5.8000000000000003E-2,0.48499999999999999,0.42599999999999999,-0.89600000000000002,0,0,0,0.89600000000000002,-4.3620000000000001,8.6999999999999994E-2,-2.06,-1.974,2.3879999999999999]
[22,0.02,0.01,0.04,5.8000000000000003E-2,0.48499999999999999,0.42599999999999999,0.71699999999999997,0,0,0,-0.71699999999999997,-4.3620000000000001,8.6999999999999994E-2,-2.06,-1.974,2.3879999999999999]
[23,0.02,0.01,0.1,5.8000000000000003E-2,0.48499999999999999,0.42599999999999999,1.7929999999999999,0,0,0,-1.7929999999999999,-4.3620000000000001,8.6999999999999994E-2,-2.06,-1.974,2.3879999999999999]
[24,0.02,0.02,-0.05,0.11600000000000001,0.96899999999999997,0.85299999999999998,-0.89600000000000002,0,0,0,0.89600000000000002,-8.7240000000000002,0.17299999999999999,-4.1210000000000004,-3.948,4.7759999999999998]
[25,0.02,0.02,0.04,0.11600000000000001,0.96899999999999997,0.85299999999999998,0.71699999999999997,0,0,0,-0.71699999999999997,-8.7240000000000002,0.17299999999999999,-4.1210000000000004,-3.948,4.7759999999999998]
[26,0.02,0.02,0.1,0.11600000000000001,0.96899999999999997,0.85299999999999998,1.7929999999999999,0,0,0,-1.7929999999999999,-8.7240000000000002,0.17299999999999999,-4.1210000000000004,-3.948,4.7759999999999998]